Repair Win32 Error 1224 (Solved)

Home > Error Code > Win32 Error 1224

Win32 Error 1224


Disconnect all previous connections to the server or shared resource and try again. ERROR_REMOTE_SESSION_LIMIT_EXCEEDED 1220 (0x4C4) An attempt was made to establish a session to a network server, but there An alternative, %hs, is available. ERROR_RESOURCE_REQUIREMENTS_CHANGED 757 The translator has translated these resources into the global space and no further translations should be performed. The file to be replaced has retained its original name. Source

ERROR_ERRORS_ENCOUNTERED 775 The implementation is not capable of performing the request. ERROR_DRIVERS_LEAKING_LOCKED_PAGES 730 The system has awoken. ERROR_BAD_ARGUMENTS 161 The specified path is invalid. The callback entrypoint should be declared as WINAPI or STDCALL.

Windows Error Codes List

The server seems to be OK now. ERROR_INVALID_ADDRESS 500 User profile cannot be loaded. Petr Vykouk Posts: 29 Registered: 6/4/00 Re: 64-bit Windows C++ Application with a FireDAC Component Might Raise Error Reply Posted: Mar 27, 2014 1:10 PM in response

ERROR_CONNECTION_COUNT_LIMIT 1239 Attempting to log in during an unauthorized time of day for this account. Back to Thread List Legend Helpful Answer (5 pts) Correct Answer (10 pts) Server Response from: ETNAJIVE02

Copyright© 1994 - 2013 Veritas does not guarantee the accuracy regarding the completeness of the translation. Error 1168 Element Not Found ERROR_RECEIVE_EXPEDITED 709 {Partial Expedited Data Received} The network transport returned partial data to its client and this data was marked as expedited by the remote system.

ERROR_NET_OPEN_FAILED 571 {Privilege Failed} The I/O permissions for the process could not be changed. Windows Error Codes Lookup Can anyone suggest what the cause of the problem might be and how it might be fixed? ERROR_MAX_SESSIONS_REACHED 400 The thread is already in background processing mode. I will look into that and see if I can resolve the problem. 0 Sign In or Register to comment.

ERROR_SERVICE_NOT_ACTIVE 1063 The service process could not connect to the service controller. System Error 1223 Has Occurred Net Use ERROR_NOT_SAME_DEVICE 18 There are no more files. ERROR_SERIAL_NO_DEVICE 1119 Unable to open a device that was sharing an interrupt request (IRQ) with other devices. ERROR_SERVICE_NO_THREAD 1055 The service database is locked.

Windows Error Codes Lookup

ERROR_BROKEN_PIPE 110 The system cannot open the device or file specified. The serial driver will unload. Windows Error Codes List ERROR_EXTRANEOUS_INFORMATION 678 This warning level status indicates that the transaction state already exists for the registry sub-tree, but that a transaction commit was previously aborted. Windows Error Codes 0x ERROR_WAKE_SYSTEM 731 n/a ERROR_WAIT_1 732 n/a ERROR_WAIT_2 733 n/a ERROR_WAIT_3 734 n/a ERROR_WAIT_63 735 n/a ERROR_ABANDONED_WAIT_0 736 n/a ERROR_ABANDONED_WAIT_63 737 n/a ERROR_USER_APC 738 n/a ERROR_KERNEL_APC 739 n/a ERROR_ALERTED 740 The requested

ERROR_DS_VERSION_CHECK_FAILURE 644 The specified range could not be found in the range list. this contact form about us tour help blog chat data legal privacy policy work here advertising info mobile contact us feedback Technology Life / Arts Culture / Recreation Science Other Stack Overflow Server Fault ERROR_QUOTA_LIST_INCONSISTENT 622 {Windows Evaluation Notification} The evaluation period for this installation of Windows has expired. ERROR_SHUTDOWN_IS_SCHEDULED 1191 The system shutdown cannot be initiated because there are other users logged on to the computer. Windows Blue Screen Error Codes

Too much data may have been put in the shared memory window. ERROR_IMAGE_MACHINE_TYPE_MISMATCH 707 {Partial Data Received} The network transport returned partial data to its client. No Yes Did this article save you the trouble of contacting technical support? ERROR_NO_SIGNAL_SENT 206 The filename or extension is too long.

ERROR_UNEXPECTED_MM_MAP_ERROR 558 If an MM error is returned which is not defined in the standard FsRtl filter, it is converted to one of the following errors which is guaranteed to be Windows Error Codes And Solutions Pdf ERROR_INCOMPATIBLE_WITH_GLOBAL_SHORT_NAME_REGISTRY_SETTING 305 Short names are not enabled on this volume. ERROR_INVALID_EVENT_COUNT 152 DosMuxSemWait did not execute; too many semaphores are already set.

For example, assignment of a primary token may only be performed when a process has zero or one threads.

ERROR_GUID_SUBSTITUTION_MADE 681 The create operation stopped after reaching a symbolic link ERROR_STOPPED_ON_SYMLINK 682 A long jump has been executed. ERROR_SUCCESS 1 Incorrect function. ERROR_DEPENDENT_SERVICES_RUNNING 1052 The requested control is not valid for this service. Windows Error Code 0xc00000e9 ERROR_COULD_NOT_INTERPRET 553 The number of active profiling objects is at the maximum and no more may be started.

Then I just install Windows developement file with x86 / x64 support and the help system files. ERROR_POTENTIAL_FILE_FOUND 1181 The journal entry has been deleted from the journal. ERROR_INVALID_VARIANT 605 The specified buffer contains ill-formed data. XE4 is better, but still no much improvement.

ERROR_SERVICE_START_HANG 1071 The specified service database lock is invalid. ERROR_NOT_SUPPORTED 51 The remote computer is not available. The remaining data will be sent later. ERROR_PROFILING_NOT_STOPPED 552 The passed ACL did not contain the minimum required information.

ERROR_SYSTEM_HIVE_TOO_LARGE 654 The driver could not be loaded because a previous version of the driver is still in memory. ERROR_ASSERTION_FAILURE 669 An error occurred in the ACPI subsystem. ERROR_FAIL_I24 84 Storage to process this request is not available. TIA Simon NEMHPT7 (Server) Wed Dec 14 12:16:21 2005 Server: setting SWEEP_QUANTUM to 250, USER_QUANTUM to 1000, SWEEP_YIELD_TIME to 1 ms and MAX_THREADS to 1000000 NEMHPT7 (Server) Wed Dec 14 12:16:21

ERROR_DLL_MIGHT_BE_INSECURE 687 The application is loading executable code from the module %hs. ERROR_TRANSLATION_COMPLETE 758 A process being terminated has no threads to terminate. ERROR_SECTOR_NOT_FOUND 28 The printer is out of paper. ERROR_INVALID_LEVEL 125 The disk has no volume label.

Click here for more details! ERROR_PROC_NOT_FOUND 128 There are no child processes to wait for.